Reaction Details
TargetKappa-type opioid receptor
LigandBDBM50336683
Substrate/Competitorn/a
Meas. Tech.ChEMBL_722916 (CHEMBL1674427)
Ki 0.133±n/a nM
Citation Nemoto, TYamamoto, NWatanabe, AFujii, HHasebe, KNakajima, MMochizuki, HNagase, H Synthesis of 6,14-epoxymorphinan derivatives and their pharmacologies. Bioorg Med Chem19:1205-21 (2011) 
 
Kappa-type opioid receptor
Name:Kappa-type opioid receptor
Type:G Protein-Coupled Receptor (GPCR)
Mol. Mass.:42744.99
Organism:Cavia porcellus (domestic guinea pig)
Description:P41144
Residue:380
BDBM50336683
NameBDBM50336683
Synonyms:CHEMBL1672490 | N-[(17-Cyclobutylmethyl-6beta,14beta-epoxy-3-hydroxymorphinan-6alpha-yl)methyl]benzamide
TypeSmall organic molecule
Emp. Form.C29H34N2O3
Mol. Mass.458.5919
SMILESOc1ccc2C[C@H]3N(CC4CCC4)CC[C@@]4(C[C@]5(CNC(=O)c6ccccc6)CC[C@@]34O5)c2c1