Reaction Details
TargetMu-type opioid receptor
LigandBDBM50336669
Substrate/Competitorn/a
Meas. Tech.ChEMBL_722917 (CHEMBL1674428)
Ki 0.0522±n/a nM
Citation Nemoto, TYamamoto, NWatanabe, AFujii, HHasebe, KNakajima, MMochizuki, HNagase, H Synthesis of 6,14-epoxymorphinan derivatives and their pharmacologies. Bioorg Med Chem19:1205-21 (2011) 
 
Mu-type opioid receptor
Name:Mu-type opioid receptor
Type:Enzyme Catalytic Domain
Mol. Mass.:11165.58
Organism:GUINEA PIG
Description:P97266
Residue:98
BDBM50336669
NameBDBM50336669
Synonyms:CHEMBL1672477 | N-[(6beta,14beta-Epoxy-3-hydroxy-17-methylmorphinan-6alpha-yl)methyl]benzamide
TypeSmall organic molecule
Emp. Form.C25H28N2O3
Mol. Mass.404.5014
SMILESCN1CC[C@]23C[C@]4(CNC(=O)c5ccccc5)CC[C@@]2(O4)[C@H]1Cc1ccc(O)cc31