Reaction Details
TargetMu-type opioid receptor
LigandBDBM50336677
Substrate/Competitorn/a
Meas. Tech.ChEMBL_722917 (CHEMBL1674428)
Ki 0.182±n/a nM
Citation Nemoto, TYamamoto, NWatanabe, AFujii, HHasebe, KNakajima, MMochizuki, HNagase, H Synthesis of 6,14-epoxymorphinan derivatives and their pharmacologies. Bioorg Med Chem19:1205-21 (2011) 
 
Mu-type opioid receptor
Name:Mu-type opioid receptor
Type:Enzyme Catalytic Domain
Mol. Mass.:11165.58
Organism:GUINEA PIG
Description:P97266
Residue:98
BDBM50336677
NameBDBM50336677
Synonyms:CHEMBL1672484 | N-[(17-Cyclopropylmethyl-6beta,14beta-epoxy-3-hydroxymorphinan-6alpha-yl)methyl]-3-phenylpropionamide
TypeSmall organic molecule
Emp. Form.C30H36N2O3
Mol. Mass.472.6184
SMILESOc1ccc2C[C@H]3N(CC4CC4)CC[C@@]4(C[C@]5(CNC(=O)CCc6ccccc6)CC[C@@]34O5)c2c1