Reaction Details
TargetMu-type opioid receptor
LigandBDBM50336679
Substrate/Competitorn/a
Meas. Tech.ChEMBL_722917 (CHEMBL1674428)
Ki 0.389±n/a nM
Citation Nemoto, TYamamoto, NWatanabe, AFujii, HHasebe, KNakajima, MMochizuki, HNagase, H Synthesis of 6,14-epoxymorphinan derivatives and their pharmacologies. Bioorg Med Chem19:1205-21 (2011) 
 
Mu-type opioid receptor
Name:Mu-type opioid receptor
Type:Enzyme Catalytic Domain
Mol. Mass.:11165.58
Organism:GUINEA PIG
Description:P97266
Residue:98
BDBM50336679
NameBDBM50336679
Synonyms:CHEMBL1672486 | N-[(6beta,14beta-Epoxy-3-hydroxy-17-isobutylmorphinan-6alpha-yl)methyl]-3-hydroxybenzamide
TypeSmall organic molecule
Emp. Form.C28H34N2O4
Mol. Mass.462.5806
SMILESCC(C)CN1CC[C@]23C[C@]4(CNC(=O)c5cccc(O)c5)CC[C@@]2(O4)[C@H]1Cc1ccc(O)cc31