Reaction Details
TargetEndothelin-1 receptor
LigandBDBM50304496
Substrate/Competitorn/a
Meas. Tech.ChEMBL_723169 (CHEMBL1675391)
Ki 1.1±n/a nM
Citation Michel, KBüther, KLaw, MPWagner, SSchober, OHermann, SSchäfers, MRiemann, BHöltke, CKopka, K Development and evaluation of endothelin-A receptor (radio)ligands for positron emission tomography. J Med Chem54:939-48 (2011) 
 
Endothelin-1 receptor
Name:Endothelin-1 receptor
Type:PROTEIN
Mol. Mass.:48591.87
Organism:Mus musculus
Description:ChEMBL_723169
Residue:427
BDBM50304496
NameBDBM50304496
Synonyms:3-Benzo[1,3]dioxol-5-yl-4-[3-(2-fluoroethoxy)-4,5-dimethoxybenzyl]-5-hydroxy-5-(4-methoxyphenyl)-5H-furan-2-one | CHEMBL594482
TypeSmall organic molecule
Emp. Form.C29H27FO9
Mol. Mass.538.5177
SMILESCOc1ccc(cc1)C1(O)OC(=O)C(=C1Cc1cc(OC)c(OC)c(OCCF)c1)c1ccc2OCOc2c1