Reaction Details
TargetPotassium voltage-gated channel subfamily H member 2
LigandBDBM50336886
Substrate/Competitorn/a
Meas. Tech.ChEMBL_718494 (CHEMBL1680289)
Ki 4200±n/a nM
Citation Sebhat, IKFranklin, CLo, MMChen, DJewell, JPMiller, RPang, JPalyha, OKan, YKelly, TMGuan, XMMarsh, DJKosinski, JAMetzger, JMLyons, KDragovic, JGuzzo, PRHenderson, AJReitman, MLNargund, RPWyvratt, MJ Discovery of MK-5046, a Potent, Selective Bombesin Receptor Subtype-3 Agonist for the Treatment of Obesity ACS Med Chem Lett2:43-47 (2011) 
 
Potassium voltage-gated channel subfamily H member 2
Name:Potassium voltage-gated channel subfamily H member 2
Type:Multi-pass membrane protein
Mol. Mass.:126672.65
Organism:Homo sapiens (Human)
Description:Q12809
Residue:1159
BDBM50336886
NameBDBM50336886
Synonyms:1-[4-(2,2-dimethylpropyl)-1H-imidazol-2-yl]-2-[4-(5-fluoropyridin-2-yl)phenyl]propan-2-ol | CHEMBL1672352
TypeSmall organic molecule
Emp. Form.C22H26FN3O
Mol. Mass.367.4597
SMILESCC(C)(C)Cc1cnc(CC(C)(O)c2ccc(cc2)-c2ccc(F)cn2)[nH]1