Reaction Details
TargetPotassium voltage-gated channel subfamily H member 2
LigandBDBM50336889
Substrate/Competitorn/a
Meas. Tech.ChEMBL_718494 (CHEMBL1680289)
Ki>8000±n/a nM
Citation Sebhat, IKFranklin, CLo, MMChen, DJewell, JPMiller, RPang, JPalyha, OKan, YKelly, TMGuan, XMMarsh, DJKosinski, JAMetzger, JMLyons, KDragovic, JGuzzo, PRHenderson, AJReitman, MLNargund, RPWyvratt, MJ Discovery of MK-5046, a Potent, Selective Bombesin Receptor Subtype-3 Agonist for the Treatment of Obesity ACS Med Chem Lett2:43-47 (2011) 
 
Potassium voltage-gated channel subfamily H member 2
Name:Potassium voltage-gated channel subfamily H member 2
Type:Multi-pass membrane protein
Mol. Mass.:126672.65
Organism:Homo sapiens (Human)
Description:Q12809
Residue:1159
BDBM50336889
NameBDBM50336889
Synonyms:(2S)-1,1,1-trifluoro-2-[4-(1H-pyrazol-1-yl)phenyl]-3-(4-{[1-(trifluoromethyl)cyclopropyl]methyl}-1H-imidazol-2-yl)propan-2-ol | CHEMBL1672354
TypeSmall organic molecule
Emp. Form.C20H18F6N4O
Mol. Mass.444.3735
SMILESO[C@@](Cc1ncc(CC2(CC2)C(F)(F)F)[nH]1)(c1ccc(cc1)-n1cccn1)C(F)(F)F