Reaction Details
TargetGlucocorticoid receptor
LigandBDBM50336936
Substrate/Competitorn/a
Meas. Tech.ChEMBL_718595 (CHEMBL1680621)
Ki>4290±n/a nM
Citation Richardson, TIClarke, CAYu, KLYee, YKBleisch, TJLopez, JEJones, SAHughes, NEMuehl, BSLugar, CWMoore, TLShetler, PKZink, RWOsborne, JJMontrose-Rafizadeh, CPatel, NGeiser, AGGalvin, RJ Novel 3-Aryl Indoles as Progesterone Receptor Antagonists for Uterine Fibroids ACS Med Chem Lett2:148-153 (2011) 
 
Glucocorticoid receptor
Name:Glucocorticoid receptor
Type:Enzyme
Mol. Mass.:85656.87
Organism:Homo sapiens (Human)
Description:P04150
Residue:777
BDBM50336936
NameBDBM50336936
Synonyms:CHEMBL1672543 | N-(3-(4-cyanophenyl)-1-methyl-1H-indol-6-yl)methanesulfonamide
TypeSmall organic molecule
Emp. Form.C17H15N3O2S
Mol. Mass.325.385
SMILESCn1cc(-c2ccc(cc2)C#N)c2ccc(NS(C)(=O)=O)cc12