Reaction Details
TargetGlucocorticoid receptor
LigandBDBM50228079
Substrate/Competitorn/a
Meas. Tech.ChEMBL_718595 (CHEMBL1680621)
Ki 6.39±n/a nM
Citation Richardson, TIClarke, CAYu, KLYee, YKBleisch, TJLopez, JEJones, SAHughes, NEMuehl, BSLugar, CWMoore, TLShetler, PKZink, RWOsborne, JJMontrose-Rafizadeh, CPatel, NGeiser, AGGalvin, RJ Novel 3-Aryl Indoles as Progesterone Receptor Antagonists for Uterine Fibroids ACS Med Chem Lett2:148-153 (2011) 
 
Glucocorticoid receptor
Name:Glucocorticoid receptor
Type:Enzyme
Mol. Mass.:85656.87
Organism:Homo sapiens (Human)
Description:P04150
Residue:777
BDBM50228079
NameBDBM50228079
Synonyms:(R)-N-(3-(1-cyclopropyl-1-(4-fluorophenyl)ethyl)-1H-indol-7-yl)methanesulfonamide | CHEMBL235209
TypeSmall organic molecule
Emp. Form.C20H21FN2O2S
Mol. Mass.372.456
SMILESC[C@](C1CC1)(c1c[nH]c2c(NS(C)(=O)=O)cccc12)c1ccc(F)cc1