Reaction Details
TargetAndrogen receptor
LigandBDBM50336933
Substrate/Competitorn/a
Meas. Tech.ChEMBL_718594 (CHEMBL1680620)
Ki 403±n/a nM
Citation Richardson, TIClarke, CAYu, KLYee, YKBleisch, TJLopez, JEJones, SAHughes, NEMuehl, BSLugar, CWMoore, TLShetler, PKZink, RWOsborne, JJMontrose-Rafizadeh, CPatel, NGeiser, AGGalvin, RJ Novel 3-Aryl Indoles as Progesterone Receptor Antagonists for Uterine Fibroids ACS Med Chem Lett2:148-153 (2011) 
 
Androgen receptor
Name:Androgen receptor
Type:Receptor
Mol. Mass.:99185.27
Organism:Homo sapiens (Human)
Description:CHO cells were stably transfected with human AR gene.
Residue:920
BDBM50336933
NameBDBM50336933
Synonyms:CHEMBL1672541 | N-(3-(4-cyano-3-methylphenyl)-1-isopropyl-1H-indol-6-yl)methanesulfonamide
TypeSmall organic molecule
Emp. Form.C20H21N3O2S
Mol. Mass.367.465
SMILESCC(C)n1cc(-c2ccc(C#N)c(C)c2)c2ccc(NS(C)(=O)=O)cc12