Reaction Details
TargetProgesterone receptor
LigandBDBM50228079
Substrate/Competitorn/a
Meas. Tech.ChEMBL_718592 (CHEMBL1680618)
Ki 454±n/a nM
Citation Richardson, TIClarke, CAYu, KLYee, YKBleisch, TJLopez, JEJones, SAHughes, NEMuehl, BSLugar, CWMoore, TLShetler, PKZink, RWOsborne, JJMontrose-Rafizadeh, CPatel, NGeiser, AGGalvin, RJ Novel 3-Aryl Indoles as Progesterone Receptor Antagonists for Uterine Fibroids ACS Med Chem Lett2:148-153 (2011) 
 
Progesterone receptor
Name:Progesterone receptor
Type:Protein
Mol. Mass.:98979.52
Organism:Homo sapiens (Human)
Description:P06401
Residue:933
BDBM50228079
NameBDBM50228079
Synonyms:(R)-N-(3-(1-cyclopropyl-1-(4-fluorophenyl)ethyl)-1H-indol-7-yl)methanesulfonamide | CHEMBL235209
TypeSmall organic molecule
Emp. Form.C20H21FN2O2S
Mol. Mass.372.456
SMILESC[C@](C1CC1)(c1c[nH]c2c(NS(C)(=O)=O)cccc12)c1ccc(F)cc1