Reaction Details
TargetHydroxycarboxylic acid receptor 3
LigandBDBM23515
Substrate/Competitorn/a
Meas. Tech.ChEMBL_718713 (CHEMBL1680932)
EC50>10000±n/a nM
Citation Qin, JRao, AChen, XZhu, XLiu, ZHuang, XDegrado, SHuang, YXiao, DAslanian, RCheewatrakoolpong, BZhang, HGreenfeder, SFarley, CCook, JKurowski, SLi, QHeek, MvChintala, MWang, GHsieh, YLi, F Discovery of a Potent Nicotinic Acid Receptor Agonist for the Treatment of Dyslipidemia ACS Med Chem Lett2:171-176 (2011) 
 
Hydroxycarboxylic acid receptor 3
Name:Hydroxycarboxylic acid receptor 3
Type:Enzyme Catalytic Domain
Mol. Mass.:44498.06
Organism:Homo sapiens (Human)
Description:GPR109B 0 HUMAN::P49019
Residue:387
BDBM23515
NameBDBM23515
Synonyms:CHEMBL573 Nicotinic Acid pyridine-3-carboxylic acid | wampocap
TypeSmall organic molecule
Emp. Form.C6H5NO2
Mol. Mass.123.1094
SMILESOC(=O)c1cccnc1