Reaction Details
TargetExtracellular calcium-sensing receptor
LigandBDBM50337114
Substrate/Competitorn/a
Meas. Tech.ChEMBL_718762 (CHEMBL1681060)
IC50 4±n/a nM
Citation Shinagawa, YInoue, TKatsushima, TKiguchi, TIkenogami, TOgawa, NFukuda, KHirata, KHarada, KTakagi, MNakagawa, TKimura, SMatsuo, YMaekawa, MHayashi, MSoejima, YTakahashi, MShindo, M Discovery of a Potent and Short−Acting Oral Calcilytic with a Pulsatile Secretion of Parathyroid Hormone ACS Med Chem Lett2:238-242 (2011) 
 
Extracellular calcium-sensing receptor
Name:Extracellular calcium-sensing receptor
Type:Protein
Mol. Mass.:120663.13
Organism:Homo sapiens (Human)
Description:P41180
Residue:1078
BDBM50337114
NameBDBM50337114
Synonyms:2'-((1R)-1-{(2R)-3-[2-Methyl-1-(naphthalen-2-yl)propan-2-ylamino]-2-hydroxypropoxy}ethyl)biphenyl-4-carboxylic acid | CHEMBL1672970
TypeSmall organic molecule
Emp. Form.C32H35NO4
Mol. Mass.497.6246
SMILESC[C@@H](OC[C@H](O)CNC(C)(C)Cc1ccc2ccccc2c1)c1ccccc1-c1ccc(cc1)C(O)=O