Reaction Details
TargetC-X-C chemokine receptor type 3
LigandBDBM50301351
Substrate/Competitorn/a
Meas. Tech.ChEMBL_726362 (CHEMBL1687494)
IC50 35±n/a nM
Citation Shao, YAnilkumar, GNCarroll, CDDong, GHall, JWHobbs, DWJiang, YJenh, CHKim, SHKozlowski, JAMcGuinness, BFRosenblum, SBSchulman, IShih, NYShu, YWong, MKYu, WZawacki, LGZeng, Q II. SAR studies of pyridyl-piperazinyl-piperidine derivatives as CXCR3 chemokine antagonists. Bioorg Med Chem Lett21:1527-31 (2011) 
 
C-X-C chemokine receptor type 3
Name:C-X-C chemokine receptor type 3
Type:Enzyme Catalytic Domain
Mol. Mass.:40665.65
Organism:Homo sapiens (Human)
Description:n/a
Residue:368
BDBM50301351
NameBDBM50301351
Synonyms:5-chloro-6-(4-(1-(4-chlorobenzyl)piperidin-4-yl)piperazin-1-yl)-N-(3,4-dichlorobenzyl)nicotinamide | CHEMBL578779
TypeSmall organic molecule
Emp. Form.C29H31Cl4N5O
Mol. Mass.607.401
SMILESClc1ccc(CN2CCC(CC2)N2CCN(CC2)c2ncc(cc2Cl)C(=O)NCc2ccc(Cl)c(Cl)c2)cc1