Reaction Details
TargetC-X-C chemokine receptor type 3
LigandBDBM50301330
Substrate/Competitorn/a
Meas. Tech.ChEMBL_726362 (CHEMBL1687494)
IC50 31±n/a nM
Citation Shao, YAnilkumar, GNCarroll, CDDong, GHall, JWHobbs, DWJiang, YJenh, CHKim, SHKozlowski, JAMcGuinness, BFRosenblum, SBSchulman, IShih, NYShu, YWong, MKYu, WZawacki, LGZeng, Q II. SAR studies of pyridyl-piperazinyl-piperidine derivatives as CXCR3 chemokine antagonists. Bioorg Med Chem Lett21:1527-31 (2011) 
 
C-X-C chemokine receptor type 3
Name:C-X-C chemokine receptor type 3
Type:Enzyme Catalytic Domain
Mol. Mass.:40665.65
Organism:Homo sapiens (Human)
Description:n/a
Residue:368
BDBM50301330
NameBDBM50301330
Synonyms:5-chloro-6-(4-((2S)-1-(4-chlorobenzyl)-2-methylpiperidin-4-yl)piperazin-1-yl)-N-methylnicotinamide | CHEMBL569117
TypeSmall organic molecule
Emp. Form.C24H31Cl2N5O
Mol. Mass.476.442
SMILESCNC(=O)c1cnc(N2CCN(CC2)C2CCN(Cc3ccc(Cl)cc3)[C@@H](C)C2)c(Cl)c1