Reaction Details
TargetGamma-aminobutyric acid receptor subunit alpha-2
LigandBDBM50337263
Substrate/Competitorn/a
Meas. Tech.ChEMBL_726366 (CHEMBL1687498)
IC50 2±n/a nM
Citation Hintermann, SHurth, KNozulak, JTintelnot-Blomley, MAichholz, RBlanz, JKaupmann, KMosbacher, J Exploring subtype selectivity and metabolic stability of a novel series of ligands for the benzodiazepine binding site of the GABAA receptor. Bioorg Med Chem Lett21:1523-6 (2011) 
 
Gamma-aminobutyric acid receptor subunit alpha-2
Name:Gamma-aminobutyric acid receptor subunit alpha-2
Type:Protein
Mol. Mass.:51338.78
Organism:Homo sapiens (Human)
Description:P47869
Residue:451
BDBM50337263
NameBDBM50337263
Synonyms:3-(2-chlorobenzyloxy)-2-(2-fluorophenyl)-2H-pyrazolo[4,3-c]quinoline | CHEMBL1681887
TypeSmall organic molecule
Emp. Form.C23H15ClFN3O
Mol. Mass.403.836
SMILESFc1ccccc1-n1nc2c(cnc3ccccc23)c1OCc1ccccc1Cl