Reaction Details
TargetGamma-aminobutyric acid receptor subunit alpha-2
LigandBDBM50337270
Substrate/Competitorn/a
Meas. Tech.ChEMBL_726366 (CHEMBL1687498)
IC50 154±n/a nM
Citation Hintermann, SHurth, KNozulak, JTintelnot-Blomley, MAichholz, RBlanz, JKaupmann, KMosbacher, J Exploring subtype selectivity and metabolic stability of a novel series of ligands for the benzodiazepine binding site of the GABAA receptor. Bioorg Med Chem Lett21:1523-6 (2011) 
 
Gamma-aminobutyric acid receptor subunit alpha-2
Name:Gamma-aminobutyric acid receptor subunit alpha-2
Type:Protein
Mol. Mass.:51338.78
Organism:Homo sapiens (Human)
Description:P47869
Residue:451
BDBM50337270
NameBDBM50337270
Synonyms:2-(4-chlorophenyl)-3-(2-fluorobenzyloxy)-6,7,8,9-tetrahydro-2H-pyrazolo[4,3-c]quinoline | CHEMBL1681895
TypeSmall organic molecule
Emp. Form.C23H19ClFN3O
Mol. Mass.407.868
SMILESFc1ccccc1COc1n(nc2c3CCCCc3ncc12)-c1ccc(Cl)cc1