Reaction Details
TargetGamma-aminobutyric acid receptor subunit alpha-2
LigandBDBM50337271
Substrate/Competitorn/a
Meas. Tech.ChEMBL_726366 (CHEMBL1687498)
IC50 57±n/a nM
Citation Hintermann, SHurth, KNozulak, JTintelnot-Blomley, MAichholz, RBlanz, JKaupmann, KMosbacher, J Exploring subtype selectivity and metabolic stability of a novel series of ligands for the benzodiazepine binding site of the GABAA receptor. Bioorg Med Chem Lett21:1523-6 (2011) 
 
Gamma-aminobutyric acid receptor subunit alpha-2
Name:Gamma-aminobutyric acid receptor subunit alpha-2
Type:Protein
Mol. Mass.:51338.78
Organism:Homo sapiens (Human)
Description:P47869
Residue:451
BDBM50337271
NameBDBM50337271
Synonyms:2-(4-chlorophenyl)-3-(4-fluorobenzyloxy)-6,7,8,9-tetrahydro-2H-pyrazolo[4,3-c]quinoline | CHEMBL1681897
TypeSmall organic molecule
Emp. Form.C23H19ClFN3O
Mol. Mass.407.868
SMILESFc1ccc(COc2n(nc3c4CCCCc4ncc23)-c2ccc(Cl)cc2)cc1