Reaction Details
TargetGamma-aminobutyric acid receptor subunit alpha-1
LigandBDBM84957
Substrate/Competitorn/a
Meas. Tech.ChEMBL_726365 (CHEMBL1687497)
IC50 1±n/a nM
Citation Hintermann, SHurth, KNozulak, JTintelnot-Blomley, MAichholz, RBlanz, JKaupmann, KMosbacher, J Exploring subtype selectivity and metabolic stability of a novel series of ligands for the benzodiazepine binding site of the GABAA receptor. Bioorg Med Chem Lett21:1523-6 (2011) 
 
Gamma-aminobutyric acid receptor subunit alpha-1
Name:Gamma-aminobutyric acid receptor subunit alpha-1
Type:Protein
Mol. Mass.:51817.35
Organism:Homo sapiens (Human)
Description:P14867
Residue:456
BDBM84957
NameBDBM84957
Synonyms:CGS 9896 | CHEMBL20042
TypeSmall organic molecule
Emp. Form.C16H10ClN3O
Mol. Mass.295.723
SMILESClc1ccc(cc1)-n1[nH]c2c(cnc3ccccc23)c1=O