Reaction Details
TargetPancreatic triacylglycerol lipase
LigandBDBM50337362
Substrate/Competitorn/a
Meas. Tech.ChEMBL_726519 (CHEMBL1685414)
IC50 12100±n/a nM
Citation Kim, THKim, JKIto, HJo, C Enhancement of pancreatic lipase inhibitory activity of curcumin by radiolytic transformation. Bioorg Med Chem Lett21:1512-4 (2011) 
 
Pancreatic triacylglycerol lipase
Name:Pancreatic triacylglycerol lipase
Type:Enzyme
Mol. Mass.:50080.69
Organism:Sus scrofa (Pig)
Description:P00591
Residue:450
BDBM50337362
NameBDBM50337362
Synonyms:CHEMBL1682391 | erythro-1-(3-methoxy-4-hydroxy-phenyl)-propan-1,2-diol
TypeSmall organic molecule
Emp. Form.C10H14O4
Mol. Mass.198.2158
SMILESCOc1cc(ccc1O)[C@@H](O)[C@H](C)O