Reaction Details
TargetProthrombin
LigandBDBM50337452
Substrate/Competitorn/a
Meas. Tech.ChEMBL_728384 (CHEMBL1685160)
Ki 0.015±n/a nM
Citation Isaacs, RCNewton, CLCutrona, KJMercer, SPDorsey, BDMcDonough, CMCook, JJKrueger, JALewis, SDLucas, BJLyle, EALynch, JJMiller-Stein, CMichener, MTWallace, AAWhite, RBWong, BK P3 optimization of functional potency, in vivo efficacy and oral bioavailability in 3-aminopyrazinone thrombin inhibitors bearing non-charged groups at the P1 position. Bioorg Med Chem Lett21:1532-5 (2011) 
 
Prothrombin
Name:Prothrombin
Type:Protein
Mol. Mass.:70029.57
Organism:Homo sapiens (Human)
Description:P00734
Residue:622
BDBM50337452
NameBDBM50337452
Synonyms:2-(4-chloro-2-((2-(6-methyl-2-oxo-3-(2-(pyridin-2-yl)ethylamino)pyrazin-1(2H)-yl)acetamido)methyl)phenoxy)-N-cyclopropylacetamide | CHEMBL1682691
TypeSmall organic molecule
Emp. Form.C26H29ClN6O4
Mol. Mass.524.999
SMILESCc1cnc(NCCc2ccccn2)c(=O)n1CC(=O)NCc1cc(Cl)ccc1OCC(=O)NC1CC1