Reaction Details
TargetProthrombin
LigandBDBM50337458
Substrate/Competitorn/a
Meas. Tech.ChEMBL_728384 (CHEMBL1685160)
Ki 1.1±n/a nM
Citation Isaacs, RCNewton, CLCutrona, KJMercer, SPDorsey, BDMcDonough, CMCook, JJKrueger, JALewis, SDLucas, BJLyle, EALynch, JJMiller-Stein, CMichener, MTWallace, AAWhite, RBWong, BK P3 optimization of functional potency, in vivo efficacy and oral bioavailability in 3-aminopyrazinone thrombin inhibitors bearing non-charged groups at the P1 position. Bioorg Med Chem Lett21:1532-5 (2011) 
 
Prothrombin
Name:Prothrombin
Type:Protein
Mol. Mass.:70029.57
Organism:Homo sapiens (Human)
Description:P00734
Residue:622
BDBM50337458
NameBDBM50337458
Synonyms:CHEMBL1682697 | N-(5-chloro-2-methylbenzyl)-2-(6-methyl-2-oxo-3-(2-(pyridin-2-yl)ethylamino)pyrazin-1(2H)-yl)acetamide
TypeSmall organic molecule
Emp. Form.C22H24ClN5O2
Mol. Mass.425.911
SMILESCc1ccc(Cl)cc1CNC(=O)Cn1c(C)cnc(NCCc2ccccn2)c1=O