Reaction Details
TargetProthrombin
LigandBDBM50337466
Substrate/Competitorn/a
Meas. Tech.ChEMBL_728384 (CHEMBL1685160)
Ki 1.1±n/a nM
Citation Isaacs, RCNewton, CLCutrona, KJMercer, SPDorsey, BDMcDonough, CMCook, JJKrueger, JALewis, SDLucas, BJLyle, EALynch, JJMiller-Stein, CMichener, MTWallace, AAWhite, RBWong, BK P3 optimization of functional potency, in vivo efficacy and oral bioavailability in 3-aminopyrazinone thrombin inhibitors bearing non-charged groups at the P1 position. Bioorg Med Chem Lett21:1532-5 (2011) 
 
Prothrombin
Name:Prothrombin
Type:Protein
Mol. Mass.:70029.57
Organism:Homo sapiens (Human)
Description:P00734
Residue:622
BDBM50337466
NameBDBM50337466
Synonyms:2-(2-(5-chloro-4-(2-(2-cyano-5-methoxybenzylamino)-2-oxoethyl)-3-oxo-3,4-dihydropyrazin-2-ylamino)ethyl)pyridine 1-oxide | CHEMBL1682761
TypeSmall organic molecule
Emp. Form.C22H21ClN6O4
Mol. Mass.468.893
SMILESCOc1ccc(C#N)c(CNC(=O)Cn2c(Cl)cnc(NCCc3cccc[n+]3[O-])c2=O)c1