Reaction Details
TargetProthrombin
LigandBDBM50337468
Substrate/Competitorn/a
Meas. Tech.ChEMBL_728384 (CHEMBL1685160)
Ki 0.76±n/a nM
Citation Isaacs, RCNewton, CLCutrona, KJMercer, SPDorsey, BDMcDonough, CMCook, JJKrueger, JALewis, SDLucas, BJLyle, EALynch, JJMiller-Stein, CMichener, MTWallace, AAWhite, RBWong, BK P3 optimization of functional potency, in vivo efficacy and oral bioavailability in 3-aminopyrazinone thrombin inhibitors bearing non-charged groups at the P1 position. Bioorg Med Chem Lett21:1532-5 (2011) 
 
Prothrombin
Name:Prothrombin
Type:Protein
Mol. Mass.:70029.57
Organism:Homo sapiens (Human)
Description:P00734
Residue:622
BDBM50337468
NameBDBM50337468
Synonyms:2-(2-(5-chloro-4-(2-(2,5-dichlorobenzylamino)-2-oxoethyl)-3-oxo-3,4-dihydropyrazin-2-ylamino)ethyl)pyridine 1-oxide | CHEMBL1682763
TypeSmall organic molecule
Emp. Form.C20H18Cl3N5O3
Mol. Mass.482.748
SMILES[O-][n+]1ccccc1CCNc1ncc(Cl)n(CC(=O)NCc2cc(Cl)ccc2Cl)c1=O