Reaction Details
TargetProthrombin
LigandBDBM50337485
Substrate/Competitorn/a
Meas. Tech.ChEMBL_728395 (CHEMBL1685171)
Ki 0.68±n/a nM
Citation Isaacs, RCNewton, CLCutrona, KJMercer, SPPayne, LSStauffer, KJWilliams, PDCook, JJKrueger, JALewis, SDLucas, BJLyle, EALynch, JJMcMasters, DRNaylor-Olsen, AMMichener, MTWallace, AA Design, synthesis and SAR of a series of 1,3,5-trisubstituted benzenes as thrombin inhibitors. Bioorg Med Chem Lett21:1536-40 (2011) 
 
Prothrombin
Name:Prothrombin
Type:Protein
Mol. Mass.:70029.57
Organism:Homo sapiens (Human)
Description:P00734
Residue:622
BDBM50337485
NameBDBM50337485
Synonyms:CHEMBL1682775 | N1-(2-(aminomethyl)-5-chlorobenzyl)-N3,N3-diisobutyl-5-methylisophthalamide
TypeSmall organic molecule
Emp. Form.C25H34ClN3O2
Mol. Mass.444.009
SMILESCC(C)CN(CC(C)C)C(=O)c1cc(C)cc(c1)C(=O)NCc1cc(Cl)ccc1CN