Reaction Details
TargetSphingosine 1-phosphate receptor 3
LigandBDBM50337589
Substrate/Competitorn/a
Meas. Tech.ChEMBL_728640 (CHEMBL1685770)
EC50>10000±n/a nM
Citation Kurata, HOtsuki, KKusumi, KKurono, MTerakado, MSeko, TMizuno, HOno, THagiya, HMinami, MNakade, SHabashita, H Structure-activity relationship studies of sphingosine-1-phosphate receptor agonists with N-cinnamyl-ß-alanine moiety. Bioorg Med Chem Lett21:1390-3 (2011) 
 
Sphingosine 1-phosphate receptor 3
Name:Sphingosine 1-phosphate receptor 3
Type:G Protein-Coupled Receptor (GPCR)
Mol. Mass.:42278.13
Organism:Homo sapiens (Human)
Description:Q99500
Residue:378
BDBM50337589
NameBDBM50337589
Synonyms:3-(3-(4-(6-phenylhexyloxy)phenyl)propylamino)propanoic acid | CHEMBL1683044
TypeSmall organic molecule
Emp. Form.C24H33NO3
Mol. Mass.383.5237
SMILESOC(=O)CCNCCCc1ccc(OCCCCCCc2ccccc2)cc1