Reaction Details
TargetSphingosine 1-phosphate receptor 3
LigandBDBM50337590
Substrate/Competitorn/a
Meas. Tech.ChEMBL_728640 (CHEMBL1685770)
EC50>10000±n/a nM
Citation Kurata, HOtsuki, KKusumi, KKurono, MTerakado, MSeko, TMizuno, HOno, THagiya, HMinami, MNakade, SHabashita, H Structure-activity relationship studies of sphingosine-1-phosphate receptor agonists with N-cinnamyl-ß-alanine moiety. Bioorg Med Chem Lett21:1390-3 (2011) 
 
Sphingosine 1-phosphate receptor 3
Name:Sphingosine 1-phosphate receptor 3
Type:G Protein-Coupled Receptor (GPCR)
Mol. Mass.:42278.13
Organism:Homo sapiens (Human)
Description:Q99500
Residue:378
BDBM50337590
NameBDBM50337590
Synonyms:3-(3-(4-(4-phenylbutoxy)phenyl)propylamino)propanoic acid | CHEMBL1683043
TypeSmall organic molecule
Emp. Form.C22H29NO3
Mol. Mass.355.4706
SMILESOC(=O)CCNCCCc1ccc(OCCCCc2ccccc2)cc1