Reaction Details
TargetSphingosine 1-phosphate receptor 2
LigandBDBM50337592
Substrate/Competitorn/a
Meas. Tech.ChEMBL_728639 (CHEMBL1685769)
EC50>10000±n/a nM
Citation Kurata, HOtsuki, KKusumi, KKurono, MTerakado, MSeko, TMizuno, HOno, THagiya, HMinami, MNakade, SHabashita, H Structure-activity relationship studies of sphingosine-1-phosphate receptor agonists with N-cinnamyl-ß-alanine moiety. Bioorg Med Chem Lett21:1390-3 (2011) 
 
Sphingosine 1-phosphate receptor 2
Name:Sphingosine 1-phosphate receptor 2
Type:G Protein-Coupled Receptor (GPCR)
Mol. Mass.:38883.16
Organism:Homo sapiens (Human)
Description:Membranes isolated from S1P2-transfected CHO cells were used in ligand binding assay.
Residue:353
BDBM50337592
NameBDBM50337592
Synonyms:3-(3-(4-(5-phenylpentyloxy)phenyl)propylamino)propanoic acid | CHEMBL1683041
TypeSmall organic molecule
Emp. Form.C23H31NO3
Mol. Mass.369.4971
SMILESOC(=O)CCNCCCc1ccc(OCCCCCc2ccccc2)cc1