Reaction Details
TargetSphingosine 1-phosphate receptor 1
LigandBDBM50337597
Substrate/Competitorn/a
Meas. Tech.ChEMBL_728638 (CHEMBL1685768)
EC50 21±n/a nM
Citation Kurata, HOtsuki, KKusumi, KKurono, MTerakado, MSeko, TMizuno, HOno, THagiya, HMinami, MNakade, SHabashita, H Structure-activity relationship studies of sphingosine-1-phosphate receptor agonists with N-cinnamyl-ß-alanine moiety. Bioorg Med Chem Lett21:1390-3 (2011) 
 
Sphingosine 1-phosphate receptor 1
Name:Sphingosine 1-phosphate receptor 1
Type:Enzyme
Mol. Mass.:42836.02
Organism:Homo sapiens (Human)
Description:P21453
Residue:382
BDBM50337597
NameBDBM50337597
Synonyms:CHEMBL1683047 | trans-3-(3-(4-(3-phenylpropoxy)phenyl)but-2-enylamino)propanoic acid
TypeSmall organic molecule
Emp. Form.C22H27NO3
Mol. Mass.353.4547
SMILESC\C(=C/CNCCC(O)=O)c1ccc(OCCCc2ccccc2)cc1