Reaction Details
TargetC-C chemokine receptor type 2
LigandBDBM50337619
Substrate/Competitorn/a
Meas. Tech.ChEMBL_728652 (CHEMBL1685782)
IC50 2.8±n/a nM
Citation Zheng, CCao, GXia, MFeng, HGlenn, JAnand, RZhang, KHuang, TWang, AKong, LLi, MGalya, LHughes, RODevraj, RMorton, PARogier, DJCovington, MBaribaud, FShin, NScherle, PDiamond, SYeleswaram, SVaddi, KNewton, RHollis, GFriedman, SMetcalf, BXue, CB Discovery of INCB10820/PF-4178903, a potent, selective, and orally bioavailable dual CCR2 and CCR5 antagonist. Bioorg Med Chem Lett21:1442-6 (2011) 
 
C-C chemokine receptor type 2
Name:C-C chemokine receptor type 2
Type:PROTEIN
Mol. Mass.:42795.68
Organism:Mus musculus
Description:ChEMBL_1502265
Residue:373
BDBM50337619
NameBDBM50337619
Synonyms:((1S,3R)-1-isopropyl-3-((3S,4S)-3-methoxytetrahydro-2H-pyran-4-ylamino)cyclopentyl)(4-(4-(trifluoromethyl)pyridin-2-yl)piperazin-1-yl)methanone CHEMBL1683074
TypeSmall organic molecule
Emp. Form.C25H37F3N4O3
Mol. Mass.498.5815
SMILESCO[C@@H]1COCC[C@@H]1N[C@@H]1CC[C@](C1)(C(C)C)C(=O)N1CCN(CC1)c1cc(ccn1)C(F)(F)F