Reaction Details
TargetProstaglandin E synthase
LigandBDBM50337655
Substrate/Competitorn/a
Meas. Tech.ChEMBL_728757 (CHEMBL1686170)
IC50 18±n/a nM
Citation Chiasson, JFBoulet, LBrideau, CChau, AClaveau, DCôté, BEthier, DGiroux, AGuay, JGuiral, SMancini, JMassé, FMéthot, NRiendeau, DRoy, PRubin, JXu, DYu, HDucharme, YFriesen, RW Trisubstituted ureas as potent and selective mPGES-1 inhibitors. Bioorg Med Chem Lett21:1488-92 (2011) 
 
Prostaglandin E synthase
Name:Prostaglandin E synthase
Type:Protein
Mol. Mass.:17112.22
Organism:Homo sapiens (Human)
Description:n/a
Residue:152
BDBM50337655
NameBDBM50337655
Synonyms:1-((5-(cyclopropylethynyl)pyridin-3-yl)methyl)-3-isopropyl-1-(3-(phenylethynyl)benzyl)urea | CHEMBL1683211
TypeSmall organic molecule
Emp. Form.C30H29N3O
Mol. Mass.447.5708
SMILESCC(C)NC(=O)N(Cc1cccc(c1)C#Cc1ccccc1)Cc1cncc(c1)C#CC1CC1