Reaction Details
TargetProstaglandin E synthase
LigandBDBM50337635
Substrate/Competitorn/a
Meas. Tech.ChEMBL_728757 (CHEMBL1686170)
IC50 1700±n/a nM
Citation Chiasson, JFBoulet, LBrideau, CChau, AClaveau, DCôté, BEthier, DGiroux, AGuay, JGuiral, SMancini, JMassé, FMéthot, NRiendeau, DRoy, PRubin, JXu, DYu, HDucharme, YFriesen, RW Trisubstituted ureas as potent and selective mPGES-1 inhibitors. Bioorg Med Chem Lett21:1488-92 (2011) 
 
Prostaglandin E synthase
Name:Prostaglandin E synthase
Type:Protein
Mol. Mass.:17112.22
Organism:Homo sapiens (Human)
Description:n/a
Residue:152
BDBM50337635
NameBDBM50337635
Synonyms:1-benzyl-1-(biphenyl-3-ylmethyl)-3-isopropylurea | CHEMBL1683191
TypeSmall organic molecule
Emp. Form.C24H26N2O
Mol. Mass.358.476
SMILESCC(C)NC(=O)N(Cc1ccccc1)Cc1cccc(c1)-c1ccccc1