Reaction Details
TargetProstaglandin E synthase
LigandBDBM50227631
Substrate/Competitorn/a
Meas. Tech.ChEMBL_728758 (CHEMBL1686171)
IC50 420±n/a nM
Citation Chiasson, JFBoulet, LBrideau, CChau, AClaveau, DCôté, BEthier, DGiroux, AGuay, JGuiral, SMancini, JMassé, FMéthot, NRiendeau, DRoy, PRubin, JXu, DYu, HDucharme, YFriesen, RW Trisubstituted ureas as potent and selective mPGES-1 inhibitors. Bioorg Med Chem Lett21:1488-92 (2011) 
 
Prostaglandin E synthase
Name:Prostaglandin E synthase
Type:Protein
Mol. Mass.:17112.22
Organism:Homo sapiens (Human)
Description:n/a
Residue:152
BDBM50227631
NameBDBM50227631
Synonyms:2-(6-chloro-1H-phenanthro[9,10-d]imidazol-2-yl)isophthalonitrile | CHEMBL412099
TypeSmall organic molecule
Emp. Form.C23H11ClN4
Mol. Mass.378.813
SMILESClc1ccc2c3[nH]c(nc3c3ccccc3c2c1)-c1c(cccc1C#N)C#N