Reaction Details
TargetProstaglandin E synthase
LigandBDBM50337660
Substrate/Competitorn/a
Meas. Tech.ChEMBL_728758 (CHEMBL1686171)
IC50 330±n/a nM
Citation Chiasson, JFBoulet, LBrideau, CChau, AClaveau, DCôté, BEthier, DGiroux, AGuay, JGuiral, SMancini, JMassé, FMéthot, NRiendeau, DRoy, PRubin, JXu, DYu, HDucharme, YFriesen, RW Trisubstituted ureas as potent and selective mPGES-1 inhibitors. Bioorg Med Chem Lett21:1488-92 (2011) 
 
Prostaglandin E synthase
Name:Prostaglandin E synthase
Type:Protein
Mol. Mass.:17112.22
Organism:Homo sapiens (Human)
Description:n/a
Residue:152
BDBM50337660
NameBDBM50337660
Synonyms:3-isopropyl-1-(3-(pyridin-3-ylethynyl)benzyl)-1-(3-((4-(trifluoromethyl)phenyl)ethynyl)benzyl)urea | CHEMBL1683216
TypeSmall organic molecule
Emp. Form.C34H28F3N3O
Mol. Mass.551.6008
SMILESCC(C)NC(=O)N(Cc1cccc(c1)C#Cc1ccc(cc1)C(F)(F)F)Cc1cccc(c1)C#Cc1cccnc1