Reaction Details
TargetProstaglandin E synthase
LigandBDBM50337645
Substrate/Competitorn/a
Meas. Tech.ChEMBL_728757 (CHEMBL1686170)
IC50 22±n/a nM
Citation Chiasson, JFBoulet, LBrideau, CChau, AClaveau, DCôté, BEthier, DGiroux, AGuay, JGuiral, SMancini, JMassé, FMéthot, NRiendeau, DRoy, PRubin, JXu, DYu, HDucharme, YFriesen, RW Trisubstituted ureas as potent and selective mPGES-1 inhibitors. Bioorg Med Chem Lett21:1488-92 (2011) 
 
Prostaglandin E synthase
Name:Prostaglandin E synthase
Type:Protein
Mol. Mass.:17112.22
Organism:Homo sapiens (Human)
Description:n/a
Residue:152
BDBM50337645
NameBDBM50337645
Synonyms:1-benzyl-1-(3-((4-chlorophenyl)ethynyl)benzyl)-3-isopropylurea | CHEMBL1683202
TypeSmall organic molecule
Emp. Form.C26H25ClN2O
Mol. Mass.416.943
SMILESCC(C)NC(=O)N(Cc1ccccc1)Cc1cccc(c1)C#Cc1ccc(Cl)cc1