Reaction Details
TargetMatrix metalloproteinase-14
LigandBDBM50337733
Substrate/Competitorn/a
Meas. Tech.ChEMBL_728837 (CHEMBL1686372)
IC50 180±n/a nM
Citation De Savi, CPape, ACumming, JGTing, ASmith, PDBurrows, JNMills, MDavies, CLamont, SMilne, DCook, CMoore, PSawyer, YGerhardt, S The design and synthesis of novel N-hydroxyformamide inhibitors of ADAM-TS4 for the treatment of osteoarthritis. Bioorg Med Chem Lett21:1376-81 (2011) 
 
Matrix metalloproteinase-14
Name:Matrix metalloproteinase-14
Type:Protein
Mol. Mass.:65900.19
Organism:Homo sapiens (Human)
Description:P50281
Residue:582
BDBM50337733
NameBDBM50337733
Synonyms:CHEMBL1683444 US10322143, Compound 2
TypeSmall organic molecule
Emp. Form.C22H27Cl2FN4O5S
Mol. Mass.549.443
SMILESC[C@@H](C[C@@H](CS(=O)(=O)N1CCC(CC1)OCc1ccc(Cl)cc1Cl)N(O)C=O)c1ncc(F)cn1