Reaction Details
TargetMatrix metalloproteinase-14
LigandBDBM50337730
Substrate/Competitorn/a
Meas. Tech.ChEMBL_728837 (CHEMBL1686372)
IC50 11±n/a nM
Citation De Savi, CPape, ACumming, JGTing, ASmith, PDBurrows, JNMills, MDavies, CLamont, SMilne, DCook, CMoore, PSawyer, YGerhardt, S The design and synthesis of novel N-hydroxyformamide inhibitors of ADAM-TS4 for the treatment of osteoarthritis. Bioorg Med Chem Lett21:1376-81 (2011) 
 
Matrix metalloproteinase-14
Name:Matrix metalloproteinase-14
Type:Protein
Mol. Mass.:65900.19
Organism:Homo sapiens (Human)
Description:P50281
Residue:582
BDBM50337730
NameBDBM50337730
Synonyms:CHEMBL1683443 | N-((2S,4S)-1-(4-(4-fluorophenyl)piperazin-1-ylsulfonyl)-4-(5-fluoropyrimidin-2-yl)pentan-2-yl)-N-hydroxyformamide
TypeSmall organic molecule
Emp. Form.C20H25F2N5O4S
Mol. Mass.469.505
SMILESC[C@@H](C[C@@H](CS(=O)(=O)N1CCN(CC1)c1ccc(F)cc1)N(O)C=O)c1ncc(F)cn1