Reaction Details
TargetA disintegrin and metalloproteinase with thrombospondin motifs 4
LigandBDBM50337741
Substrate/Competitorn/a
Meas. Tech.ChEMBL_728834 (CHEMBL1686369)
IC50 4.2±n/a nM
Citation De Savi, CPape, ACumming, JGTing, ASmith, PDBurrows, JNMills, MDavies, CLamont, SMilne, DCook, CMoore, PSawyer, YGerhardt, S The design and synthesis of novel N-hydroxyformamide inhibitors of ADAM-TS4 for the treatment of osteoarthritis. Bioorg Med Chem Lett21:1376-81 (2011) 
 
A disintegrin and metalloproteinase with thrombospondin motifs 4
Name:A disintegrin and metalloproteinase with thrombospondin motifs 4
Type:Enzyme
Mol. Mass.:90214.54
Organism:Homo sapiens (Human)
Description:O75173
Residue:837
BDBM50337741
NameBDBM50337741
Synonyms:CHEMBL1683462 US10322143, Compound 8o
TypeSmall organic molecule
Emp. Form.C24H30ClF4N5O4S
Mol. Mass.596.038
SMILESC[C@@H](C[C@@](C)(CS(=O)(=O)N1CCC(CCc2ncc(cc2Cl)C(F)(F)F)CC1)N(O)C=O)c1ncc(F)cn1