Reaction Details
TargetMatrix metalloproteinase-14
LigandBDBM50337743
Substrate/Competitorn/a
Meas. Tech.ChEMBL_728837 (CHEMBL1686372)
IC50 18000±n/a nM
Citation De Savi, CPape, ACumming, JGTing, ASmith, PDBurrows, JNMills, MDavies, CLamont, SMilne, DCook, CMoore, PSawyer, YGerhardt, S The design and synthesis of novel N-hydroxyformamide inhibitors of ADAM-TS4 for the treatment of osteoarthritis. Bioorg Med Chem Lett21:1376-81 (2011) 
 
Matrix metalloproteinase-14
Name:Matrix metalloproteinase-14
Type:Protein
Mol. Mass.:65900.19
Organism:Homo sapiens (Human)
Description:P50281
Residue:582
BDBM50337743
NameBDBM50337743
Synonyms:CHEMBL1683456 US10322143, Compound 8i
TypeSmall organic molecule
Emp. Form.C28H36F4N4O4S
Mol. Mass.600.668
SMILESC[C@@H](C[C@@](C)(CS(=O)(=O)N1CCC(CCc2ccc(cc2C2CC2)C(F)(F)F)CC1)N(O)C=O)c1ncc(F)cn1