Reaction Details
TargetA disintegrin and metalloproteinase with thrombospondin motifs 4
LigandBDBM50337721
Substrate/Competitorn/a
Meas. Tech.ChEMBL_728834 (CHEMBL1686369)
IC50 0.180000±n/a nM
Citation De Savi, CPape, ACumming, JGTing, ASmith, PDBurrows, JNMills, MDavies, CLamont, SMilne, DCook, CMoore, PSawyer, YGerhardt, S The design and synthesis of novel N-hydroxyformamide inhibitors of ADAM-TS4 for the treatment of osteoarthritis. Bioorg Med Chem Lett21:1376-81 (2011) 
 
A disintegrin and metalloproteinase with thrombospondin motifs 4
Name:A disintegrin and metalloproteinase with thrombospondin motifs 4
Type:Enzyme
Mol. Mass.:90214.54
Organism:Homo sapiens (Human)
Description:O75173
Residue:837
BDBM50337721
NameBDBM50337721
Synonyms:CHEMBL1683454 US10322143, Compound 8g
TypeSmall organic molecule
Emp. Form.C25H34F2N4O4S
Mol. Mass.524.624
SMILESC[C@@H](C[C@@](C)(CS(=O)(=O)N1CCC(CCc2ccc(F)cc2C)CC1)N(O)C=O)c1ncc(F)cn1