Reaction Details
Target72 kDa type IV collagenase
LigandBDBM50337721
Substrate/Competitorn/a
Meas. Tech.ChEMBL_726751 (CHEMBL1686225)
IC50 120±n/a nM
Citation De Savi, CPape, ACumming, JGTing, ASmith, PDBurrows, JNMills, MDavies, CLamont, SMilne, DCook, CMoore, PSawyer, YGerhardt, S The design and synthesis of novel N-hydroxyformamide inhibitors of ADAM-TS4 for the treatment of osteoarthritis. Bioorg Med Chem Lett21:1376-81 (2011) 
 
72 kDa type IV collagenase
Name:72 kDa type IV collagenase
Type:Enzyme
Mol. Mass.:73870.36
Organism:Homo sapiens (Human)
Description: P08253
Residue:660
BDBM50337721
NameBDBM50337721
Synonyms:CHEMBL1683454 US10322143, Compound 8g
TypeSmall organic molecule
Emp. Form.C25H34F2N4O4S
Mol. Mass.524.624
SMILESC[C@@H](C[C@@](C)(CS(=O)(=O)N1CCC(CCc2ccc(F)cc2C)CC1)N(O)C=O)c1ncc(F)cn1