Reaction Details
Target72 kDa type IV collagenase
LigandBDBM50337736
Substrate/Competitorn/a
Meas. Tech.ChEMBL_726751 (CHEMBL1686225)
IC50 350±n/a nM
Citation De Savi, CPape, ACumming, JGTing, ASmith, PDBurrows, JNMills, MDavies, CLamont, SMilne, DCook, CMoore, PSawyer, YGerhardt, S The design and synthesis of novel N-hydroxyformamide inhibitors of ADAM-TS4 for the treatment of osteoarthritis. Bioorg Med Chem Lett21:1376-81 (2011) 
 
72 kDa type IV collagenase
Name:72 kDa type IV collagenase
Type:Enzyme
Mol. Mass.:73870.36
Organism:Homo sapiens (Human)
Description: P08253
Residue:660
BDBM50337736
NameBDBM50337736
Synonyms:CHEMBL1683455 US10322143, Compound 8h
TypeSmall organic molecule
Emp. Form.C26H34F4N4O4S
Mol. Mass.574.631
SMILESC[C@@H](C[C@@](C)(CS(=O)(=O)N1CCC(CCc2ccc(cc2C)C(F)(F)F)CC1)N(O)C=O)c1ncc(F)cn1