Reaction Details
Target72 kDa type IV collagenase
LigandBDBM50337727
Substrate/Competitorn/a
Meas. Tech.ChEMBL_726751 (CHEMBL1686225)
IC50 4200±n/a nM
Citation De Savi, CPape, ACumming, JGTing, ASmith, PDBurrows, JNMills, MDavies, CLamont, SMilne, DCook, CMoore, PSawyer, YGerhardt, S The design and synthesis of novel N-hydroxyformamide inhibitors of ADAM-TS4 for the treatment of osteoarthritis. Bioorg Med Chem Lett21:1376-81 (2011) 
 
72 kDa type IV collagenase
Name:72 kDa type IV collagenase
Type:Enzyme
Mol. Mass.:73870.36
Organism:Homo sapiens (Human)
Description: P08253
Residue:660
BDBM50337727
NameBDBM50337727
Synonyms:CHEMBL1683457 US10322143, Compound 8j
TypeSmall organic molecule
Emp. Form.C26H37FN4O4S
Mol. Mass.520.66
SMILESC[C@@H](C[C@@](C)(CS(=O)(=O)N1CCC(CCc2cc(C)ccc2C)CC1)N(O)C=O)c1ncc(F)cn1