Reaction Details
TargetCytochrome P450 3A4
LigandBDBM50337729
Substrate/Competitorn/a
Meas. Tech.ChEMBL_726744 (CHEMBL1686218)
IC50>10±n/a nM
Citation De Savi, CPape, ACumming, JGTing, ASmith, PDBurrows, JNMills, MDavies, CLamont, SMilne, DCook, CMoore, PSawyer, YGerhardt, S The design and synthesis of novel N-hydroxyformamide inhibitors of ADAM-TS4 for the treatment of osteoarthritis. Bioorg Med Chem Lett21:1376-81 (2011) 
 
Cytochrome P450 3A4
Name:Cytochrome P450 3A4
Type:Enzyme
Mol. Mass.:57349.57
Organism:Homo sapiens (Human)
Description:n/a
Residue:503
BDBM50337729
NameBDBM50337729
Synonyms:CHEMBL1615186 N-[(2S,4S)-1-({4-[(2,4-dichlorobenzyl)oxy]piperidin-1-yl}sulfonyl)-4-(5-fluoropyrimidin-2-yl)-2-methylpentan-2-yl]-N-hydroxyformamide | US10322143, Compound 4
TypeSmall organic molecule
Emp. Form.C23H29Cl2FN4O5S
Mol. Mass.563.47
SMILESC[C@@H](C[C@@](C)(CS(=O)(=O)N1CCC(CC1)OCc1ccc(Cl)cc1Cl)N(O)C=O)c1ncc(F)cn1