Reaction Details
TargetInterstitial collagenase
LigandBDBM50337734
Substrate/Competitorn/a
Meas. Tech.ChEMBL_728835 (CHEMBL1686370)
IC50>70000±n/a nM
Citation De Savi, CPape, ACumming, JGTing, ASmith, PDBurrows, JNMills, MDavies, CLamont, SMilne, DCook, CMoore, PSawyer, YGerhardt, S The design and synthesis of novel N-hydroxyformamide inhibitors of ADAM-TS4 for the treatment of osteoarthritis. Bioorg Med Chem Lett21:1376-81 (2011) 
 
Interstitial collagenase
Name:Interstitial collagenase
Type:Enzyme
Mol. Mass.:54010.26
Organism:Homo sapiens (Human)
Description: P03956
Residue:469
BDBM50337734
NameBDBM50337734
Synonyms:CHEMBL1683464 US10322143, Compound 8q
TypeSmall organic molecule
Emp. Form.C25H34ClFN4O6S2
Mol. Mass.605.142
SMILESC[C@@H](C[C@@](C)(CS(=O)(=O)N1CCC(CCc2ccc(cc2Cl)S(C)(=O)=O)CC1)N(O)C=O)c1ncc(F)cn1