Reaction Details
TargetCarbonic anhydrase 5B, mitochondrial
LigandBDBM50337751
Substrate/Competitorn/a
Meas. Tech.ChEMBL_726764 (CHEMBL1686238)
Ki 54.1±n/a nM
Citation Maresca, ASupuran, CT (R)-/(S)-10-camphorsulfonyl-substituted aromatic/heterocyclic sulfonamides selectively inhibit mitochondrial over cytosolic carbonic anhydrases. Bioorg Med Chem Lett21:1334-7 (2011) 
 
Carbonic anhydrase 5B, mitochondrial
Name:Carbonic anhydrase 5B, mitochondrial
Type:Enzyme
Mol. Mass.:36440.83
Organism:Homo sapiens (Human)
Description:Human (cloned) isozyme
Residue:317
BDBM50337751
NameBDBM50337751
Synonyms:4-(2-(((1S)-7,7-Dimethyl-2-oxobicyclo[2.2.1]heptan-1-yl)methylsulfonamido)ethyl)benzene sulfonamide | CHEMBL1683471
TypeSmall organic molecule
Emp. Form.C18H26N2O5S2
Mol. Mass.414.539
SMILESCC1(C)C2CC[C@@]1(CS(=O)(=O)NCCc1ccc(cc1)S(N)(=O)=O)C(=O)C2