Reaction Details
TargetCarbonic anhydrase 2
LigandBDBM50337755
Substrate/Competitorn/a
Meas. Tech.ChEMBL_726762 (CHEMBL1686236)
Ki 398±n/a nM
Citation Maresca, ASupuran, CT (R)-/(S)-10-camphorsulfonyl-substituted aromatic/heterocyclic sulfonamides selectively inhibit mitochondrial over cytosolic carbonic anhydrases. Bioorg Med Chem Lett21:1334-7 (2011) 
 
Carbonic anhydrase 2
Name:Carbonic anhydrase 2
Type:Enzyme
Mol. Mass.:29250.71
Organism:Homo sapiens (Human)
Description:P00918
Residue:260
BDBM50337755
NameBDBM50337755
Synonyms:5-(((1S)-7,7-dimethyl-2-oxobicyclo[2.2.1]heptan-1-yl)methylsulfonylimino)-4-methyl-4,5-dihydro-1,3,4-thiadiazole-2-sulfonamide | CHEMBL1683475
TypeSmall organic molecule
Emp. Form.C13H20N4O5S3
Mol. Mass.408.517
SMILESCn1nc(sc1=NS(=O)(=O)C[C@]12CCC(CC1=O)C2(C)C)S(N)(=O)=O