Reaction Details
TargetCarbonic anhydrase 1
LigandBDBM50337749
Substrate/Competitorn/a
Meas. Tech.ChEMBL_726761 (CHEMBL1686235)
Ki 1042±n/a nM
Citation Maresca, ASupuran, CT (R)-/(S)-10-camphorsulfonyl-substituted aromatic/heterocyclic sulfonamides selectively inhibit mitochondrial over cytosolic carbonic anhydrases. Bioorg Med Chem Lett21:1334-7 (2011) 
 
Carbonic anhydrase 1
Name:Carbonic anhydrase 1
Type:Enzyme
Mol. Mass.:28873.37
Organism:Homo sapiens (Human)
Description:P00915
Residue:261
BDBM50337749
NameBDBM50337749
Synonyms:4-((((1S)-7,7-dimethyl-2-oxobicyclo[2.2.1]heptan-1-yl)methylsulfonamido)methyl)benzenesulfonamide | CHEMBL1683469
TypeSmall organic molecule
Emp. Form.C17H24N2O5S2
Mol. Mass.400.513
SMILESCC1(C)C2CC[C@@]1(CS(=O)(=O)NCc1ccc(cc1)S(N)(=O)=O)C(=O)C2