Reaction Details
TargetVascular endothelial growth factor receptor 2
LigandBDBM50337799
Substrate/Competitorn/a
Meas. Tech.ChEMBL_726802 (CHEMBL1686402)
Ki 25±n/a nM
Citation Kawakami, JKMartinez, YSasaki, BHarris, MKurata, WELau, AF Investigation of a novel molecular descriptor for the lead optimization of 4-aminoquinazolines as vascular endothelial growth factor receptor-2 inhibitors: application for quantitative structure-activity relationship analysis in lead optimization. Bioorg Med Chem Lett21:1371-5 (2011) 
 
Vascular endothelial growth factor receptor 2
Name:Vascular endothelial growth factor receptor 2
Type:Receptor Tyrosine Kinase
Mol. Mass.:151510.97
Organism:Homo sapiens (Human)
Description:P35968
Residue:1356
BDBM50337799
NameBDBM50337799
Synonyms:(6aR,10aR)-6,6,9-trimethyl-3-(5,5,5-trifluoropentyl)-6a,7,10,10a-tetrahydro-6H-benzo[c]chromen-1-ol | CHEMBL1683649
TypeSmall organic molecule
Emp. Form.C21H27F3O2
Mol. Mass.368.4331
SMILESCC1=CC[C@@H]2[C@@H](C1)c1c(O)cc(CCCCC(F)(F)F)cc1OC2(C)C