Reaction Details
TargetVascular endothelial growth factor receptor 2
LigandBDBM50337800
Substrate/Competitorn/a
Meas. Tech.ChEMBL_726802 (CHEMBL1686402)
Ki 103±n/a nM
Citation Kawakami, JKMartinez, YSasaki, BHarris, MKurata, WELau, AF Investigation of a novel molecular descriptor for the lead optimization of 4-aminoquinazolines as vascular endothelial growth factor receptor-2 inhibitors: application for quantitative structure-activity relationship analysis in lead optimization. Bioorg Med Chem Lett21:1371-5 (2011) 
 
Vascular endothelial growth factor receptor 2
Name:Vascular endothelial growth factor receptor 2
Type:Receptor Tyrosine Kinase
Mol. Mass.:151510.97
Organism:Homo sapiens (Human)
Description:P35968
Residue:1356
BDBM50337800
NameBDBM50337800
Synonyms:(6aR,10aR)-9-(fluoromethyl)-6,6-dimethyl-3-pentyl-6a,7,10,10a-tetrahydro-6H-benzo[c]chromen-1-ol | CHEMBL1683650
TypeSmall organic molecule
Emp. Form.C21H29FO2
Mol. Mass.332.4522
SMILESCCCCCc1cc(O)c2[C@@H]3CC(CF)=CC[C@H]3C(C)(C)Oc2c1